Information card for entry 7059275
Formula | C18 H15 Br N2 O2 S |
Calculated formula | C18 H15 Br N2 O2 S |
Title of publication | Synthesis of tetrahydrothiopyrano[2,3-b]indoles via [3+3] annulation of nitroallylic acetates with indoline-2-thiones |
Authors of publication | Basu, Pallabita; Hazra, Chiranjit; Baiju, Thekke V.; Namboothiri, Irishi N. N. |
Journal of publication | New Journal of Chemistry |
Year of publication | 2020 |
Journal volume | 44 |
Journal issue | 4 |
Pages of publication | 1389 - 1399 |
a | 29.6557 ± 0.0007 Å |
b | 29.6557 ± 0.0007 Å |
c | 9.9045 ± 0.0003 Å |
α | 90° |
β | 90° |
γ | 120° |
Cell volume | 7543.6 ± 0.3 Å3 |
Cell temperature | 293 ± 2 K |
Ambient diffraction temperature | 293 ± 2 K |
Number of distinct elements | 6 |
Space group number | 148 |
Hermann-Mauguin space group symbol | R -3 :H |
Hall space group symbol | -R 3 |
Residual factor for all reflections | 0.0324 |
Residual factor for significantly intense reflections | 0.0279 |
Weighted residual factors for significantly intense reflections | 0.0633 |
Weighted residual factors for all reflections included in the refinement | 0.0654 |
Goodness-of-fit parameter for all reflections included in the refinement | 1.036 |
Diffraction radiation probe | x-ray |
Diffraction radiation wavelength | 0.71073 Å |
Diffraction radiation type | MoKα |