Information card for entry 7059788
Formula | C14 H26 Co Mo4 N12 O16 |
Calculated formula | C14 H26 Co Mo4 N12 O16 |
Title of publication | Octamolybdate-based hybrid constructed by flexible bis-triazole ligands: synthesis, photocatalytic and electrochemical properties |
Authors of publication | Chi, Jiaqi; Fan, Mingyue; Su, Zhongmin; Li, Xiao; Sun, Jing; Zhou, Chen; Hu, Xiaoli |
Journal of publication | New Journal of Chemistry |
Year of publication | 2020 |
Journal volume | 44 |
Journal issue | 32 |
Pages of publication | 13524 - 13528 |
a | 11.734 ± 0.002 Å |
b | 21.779 ± 0.004 Å |
c | 12.503 ± 0.002 Å |
α | 90° |
β | 104.189 ± 0.002° |
γ | 90° |
Cell volume | 3097.7 ± 0.9 Å3 |
Cell temperature | 273.15 K |
Ambient diffraction temperature | 273.15 K |
Number of distinct elements | 6 |
Space group number | 14 |
Hermann-Mauguin space group symbol | P 1 21/n 1 |
Hall space group symbol | -P 2yn |
Residual factor for all reflections | 0.0302 |
Residual factor for significantly intense reflections | 0.0239 |
Weighted residual factors for significantly intense reflections | 0.0536 |
Weighted residual factors for all reflections included in the refinement | 0.0563 |
Goodness-of-fit parameter for all reflections included in the refinement | 1.052 |
Diffraction radiation probe | x-ray |
Diffraction radiation wavelength | 0.71073 Å |
Diffraction radiation type | MoKα |
Diffraction radiation X-ray symbol | K-L~3~ |