Information card for entry 7059884
Formula | C26 H24 Ag N8 O42 P W12 |
Calculated formula | C26 H24 Ag N8 O42.0096 P W12 |
Title of publication | Four Keggin-based compounds constructed by a series of pyridine derivatives: synthesis, and electrochemical, photocatalytic and fluorescence sensing properties |
Authors of publication | Mou, Hai-chen; Ying, Jun; Tian, Ai-xiang; Cui, Hong-tao; Wang, Xiu-li |
Journal of publication | New Journal of Chemistry |
Year of publication | 2020 |
Journal volume | 44 |
Journal issue | 35 |
Pages of publication | 15122 - 15130 |
a | 11.367 ± 0.004 Å |
b | 13.097 ± 0.005 Å |
c | 20.578 ± 0.006 Å |
α | 90° |
β | 112.338 ± 0.016° |
γ | 90° |
Cell volume | 2833.6 ± 1.7 Å3 |
Cell temperature | 293 ± 2 K |
Ambient diffraction temperature | 293 ± 2 K |
Number of distinct elements | 7 |
Space group number | 14 |
Hermann-Mauguin space group symbol | P 1 21/c 1 |
Hall space group symbol | -P 2ybc |
Residual factor for all reflections | 0.0723 |
Residual factor for significantly intense reflections | 0.043 |
Weighted residual factors for significantly intense reflections | 0.0752 |
Weighted residual factors for all reflections included in the refinement | 0.0844 |
Goodness-of-fit parameter for all reflections included in the refinement | 1.02 |
Diffraction radiation wavelength | 0.71073 Å |
Diffraction radiation type | MoKα |