Information card for entry 7060447
Formula | C42 H44 Ag6 Cd N12 O22 S6 |
Calculated formula | C42 H44 Ag6 Cd N12 O22 S6 |
Title of publication | Aliphatic amine mediated assembly of [M6(mna)6] (M = Cu/Ag) into extended two-dimensional structures: synthesis, structure and Lewis acid catalytic studies |
Authors of publication | Sarkar, Anupam; Jana, Ajay Kumar; Natarajan, Srinivasan |
Journal of publication | New Journal of Chemistry |
Year of publication | 2021 |
Journal volume | 45 |
Journal issue | 14 |
Pages of publication | 6503 - 6511 |
a | 11.8171 ± 0.0011 Å |
b | 12.2377 ± 0.001 Å |
c | 12.5376 ± 0.0011 Å |
α | 65.73 ± 0.004° |
β | 81.992 ± 0.005° |
γ | 76.182 ± 0.004° |
Cell volume | 1603.3 ± 0.2 Å3 |
Cell temperature | 293 ± 2 K |
Ambient diffraction temperature | 293 ± 2 K |
Number of distinct elements | 7 |
Space group number | 2 |
Hermann-Mauguin space group symbol | P -1 |
Hall space group symbol | -P 1 |
Residual factor for all reflections | 0.0388 |
Residual factor for significantly intense reflections | 0.0301 |
Weighted residual factors for significantly intense reflections | 0.0871 |
Weighted residual factors for all reflections included in the refinement | 0.0969 |
Goodness-of-fit parameter for all reflections included in the refinement | 0.949 |
Diffraction radiation wavelength | 0.71073 Å |
Diffraction radiation type | MoKα |