Information card for entry 7060461
Formula | C48 H48 Dy2 N7 O20 |
Calculated formula | C48 H48 Dy2 N7 O20 |
Title of publication | Lanthanide-based bis-(3,5-dicarboxy-phenyl)terephthalamide metal‒organic frameworks: slow relaxation of magnetization and detection of trace Fe2+ and Fe3+ |
Authors of publication | Lin, Qingfang; Xie, Wen; Zong, Zhihui; Liu, Zicheng; Sun, Yuqing; Liang, Lili |
Journal of publication | New Journal of Chemistry |
Year of publication | 2021 |
Journal volume | 45 |
Journal issue | 16 |
Pages of publication | 7382 - 7389 |
a | 36.681 ± 0.002 Å |
b | 21.1352 ± 0.0009 Å |
c | 19.0189 ± 0.001 Å |
α | 90° |
β | 90.535 ± 0.002° |
γ | 90° |
Cell volume | 14744 ± 1.3 Å3 |
Cell temperature | 173 ± 2 K |
Ambient diffraction temperature | 173 K |
Number of distinct elements | 5 |
Space group number | 15 |
Hermann-Mauguin space group symbol | C 1 2/c 1 |
Hall space group symbol | -C 2yc |
Residual factor for all reflections | 0.1342 |
Residual factor for significantly intense reflections | 0.0787 |
Weighted residual factors for significantly intense reflections | 0.194 |
Weighted residual factors for all reflections included in the refinement | 0.2428 |
Goodness-of-fit parameter for all reflections included in the refinement | 1.03 |
Diffraction radiation wavelength | 0.71073 Å |
Diffraction radiation type | MoKα |