Information card for entry 7060463
Formula | C22 H12 Co N8 |
Calculated formula | C22 H12 Co N8 |
Title of publication | Syntheses, structures and magnetic properties of two isostructural dicyanamide-bridged 2D polymers |
Authors of publication | Kliuikov, Andrii; Bukrynov, Oleksandr; Čižmár, Erik; Váhovská, Lucia; Vitushkina, Svitlana; Samoľová, Erika; Potočňák, Ivan |
Journal of publication | New Journal of Chemistry |
Year of publication | 2021 |
Journal volume | 45 |
Journal issue | 16 |
Pages of publication | 7117 - 7128 |
a | 9.9045 ± 0.0002 Å |
b | 15.9949 ± 0.0003 Å |
c | 12.6185 ± 0.0002 Å |
α | 90° |
β | 96.154 ± 0.002° |
γ | 90° |
Cell volume | 1987.52 ± 0.06 Å3 |
Cell temperature | 120 ± 2 K |
Ambient diffraction temperature | 120 ± 2 K |
Number of distinct elements | 4 |
Space group number | 14 |
Hermann-Mauguin space group symbol | P 1 21/n 1 |
Hall space group symbol | -P 2yn |
Residual factor for all reflections | 0.0269 |
Residual factor for significantly intense reflections | 0.0233 |
Weighted residual factors for significantly intense reflections | 0.0582 |
Weighted residual factors for all reflections included in the refinement | 0.0606 |
Goodness-of-fit parameter for all reflections included in the refinement | 1.028 |
Diffraction radiation wavelength | 0.71073 Å |
Diffraction radiation type | MoKα |