Information card for entry 7060475
Formula | C16 H12 F N O2 |
Calculated formula | C16 H12 F N O2 |
Title of publication | Nonlinear optical properties of diaromatic stilbene, butadiene and thiophene derivatives |
Authors of publication | Kukkonen, Esa; Lahtinen, Elmeri; Myllyperkiö, Pasi; Haukka, Matti; Konu, Jari |
Journal of publication | New Journal of Chemistry |
Year of publication | 2021 |
Journal volume | 45 |
Journal issue | 15 |
Pages of publication | 6640 - 6650 |
a | 7.1272 ± 0.0002 Å |
b | 12.8757 ± 0.0004 Å |
c | 7.3763 ± 0.0003 Å |
α | 90° |
β | 104.703 ± 0.004° |
γ | 90° |
Cell volume | 654.74 ± 0.04 Å3 |
Cell temperature | 120 ± 0.1 K |
Ambient diffraction temperature | 120 ± 0.1 K |
Number of distinct elements | 5 |
Space group number | 7 |
Hermann-Mauguin space group symbol | P 1 c 1 |
Hall space group symbol | P -2yc |
Residual factor for all reflections | 0.0351 |
Residual factor for significantly intense reflections | 0.0334 |
Weighted residual factors for significantly intense reflections | 0.0933 |
Weighted residual factors for all reflections included in the refinement | 0.0962 |
Goodness-of-fit parameter for all reflections included in the refinement | 1.063 |
Diffraction radiation probe | x-ray |
Diffraction radiation wavelength | 1.54184 Å |
Diffraction radiation type | CuKα |