Information card for entry 7060478
Formula | C32 H28 Cl2 N2 O8 |
Calculated formula | C32 H28 Cl2 N2 O8 |
Title of publication | Nonlinear optical properties of diaromatic stilbene, butadiene and thiophene derivatives |
Authors of publication | Kukkonen, Esa; Lahtinen, Elmeri; Myllyperkiö, Pasi; Haukka, Matti; Konu, Jari |
Journal of publication | New Journal of Chemistry |
Year of publication | 2021 |
Journal volume | 45 |
Journal issue | 15 |
Pages of publication | 6640 - 6650 |
a | 14.672 ± 0.0003 Å |
b | 10.3954 ± 0.0002 Å |
c | 18.9716 ± 0.0003 Å |
α | 90° |
β | 93.264 ± 0.002° |
γ | 90° |
Cell volume | 2888.88 ± 0.09 Å3 |
Cell temperature | 121 ± 1 K |
Ambient diffraction temperature | 121 ± 1 K |
Number of distinct elements | 5 |
Space group number | 15 |
Hermann-Mauguin space group symbol | C 1 2/c 1 |
Hall space group symbol | -C 2yc |
Residual factor for all reflections | 0.0377 |
Residual factor for significantly intense reflections | 0.0355 |
Weighted residual factors for significantly intense reflections | 0.0957 |
Weighted residual factors for all reflections included in the refinement | 0.0981 |
Goodness-of-fit parameter for all reflections included in the refinement | 1.052 |
Diffraction radiation probe | x-ray |
Diffraction radiation wavelength | 1.54184 Å |
Diffraction radiation type | CuKα |