Information card for entry 7060487
Formula | C27 H20 Te |
Calculated formula | C27 H20 Te |
Title of publication | Selanyl and tellanyl electrophiles as a driving force in the construction of sophisticated polyaromatic hydrocarbons |
Authors of publication | Arsenyan, Pavel; Petrenko, Alla; Belyakov, Sergey |
Journal of publication | New Journal of Chemistry |
Year of publication | 2021 |
Journal volume | 45 |
Journal issue | 16 |
Pages of publication | 7247 - 7255 |
a | 16.1677 ± 0.0004 Å |
b | 7.6561 ± 0.0002 Å |
c | 17.3557 ± 0.0004 Å |
α | 90° |
β | 109.196 ± 0.003° |
γ | 90° |
Cell volume | 2028.87 ± 0.09 Å3 |
Cell temperature | 140 ± 0.1 K |
Ambient diffraction temperature | 140 ± 0.1 K |
Number of distinct elements | 3 |
Space group number | 14 |
Hermann-Mauguin space group symbol | P 1 21/c 1 |
Hall space group symbol | -P 2ybc |
Residual factor for all reflections | 0.0223 |
Residual factor for significantly intense reflections | 0.0202 |
Weighted residual factors for significantly intense reflections | 0.052 |
Weighted residual factors for all reflections included in the refinement | 0.053 |
Goodness-of-fit parameter for all reflections included in the refinement | 1.0435 |
Diffraction radiation probe | x-ray |
Diffraction radiation wavelength | 0.71073 Å |
Diffraction radiation type | MoKα |