Information card for entry 7060489
Formula | C34 H22 Se |
Calculated formula | C34 H22 Se |
Title of publication | Selanyl and tellanyl electrophiles as a driving force in the construction of sophisticated polyaromatic hydrocarbons |
Authors of publication | Arsenyan, Pavel; Petrenko, Alla; Belyakov, Sergey |
Journal of publication | New Journal of Chemistry |
Year of publication | 2021 |
Journal volume | 45 |
Journal issue | 16 |
Pages of publication | 7247 - 7255 |
a | 9.2854 ± 0.0003 Å |
b | 18.7578 ± 0.0006 Å |
c | 14.0866 ± 0.0006 Å |
α | 90° |
β | 103.351 ± 0.004° |
γ | 90° |
Cell volume | 2387.21 ± 0.15 Å3 |
Cell temperature | 150 ± 0.1 K |
Ambient diffraction temperature | 150 ± 0.1 K |
Number of distinct elements | 3 |
Space group number | 14 |
Hermann-Mauguin space group symbol | P 1 21/c 1 |
Hall space group symbol | -P 2ybc |
Residual factor for all reflections | 0.0582 |
Residual factor for significantly intense reflections | 0.0413 |
Weighted residual factors for significantly intense reflections | 0.1044 |
Weighted residual factors for all reflections included in the refinement | 0.1105 |
Goodness-of-fit parameter for all reflections included in the refinement | 1.085 |
Diffraction radiation probe | x-ray |
Diffraction radiation wavelength | 0.71073 Å |
Diffraction radiation type | MoKα |