Information card for entry 7060525
Formula | C34 H27 N3 O3 S |
Calculated formula | C34 H27 N3 O3 S |
Title of publication | Molecular diversity of the acid promoted domino reaction of 3-hydroxy-3-(indol-3-yl)indolin-2-ones and cyclic mercapto-substituted β-enamino esters |
Authors of publication | Pan, Liu-Na; Wang, Qing; Sun, Jing; Sun, Quan-Shun; Yan, Chao-Guo |
Journal of publication | New Journal of Chemistry |
Year of publication | 2021 |
Journal volume | 45 |
Journal issue | 18 |
Pages of publication | 8314 - 8320 |
a | 15.8114 ± 0.0008 Å |
b | 10.6093 ± 0.0004 Å |
c | 17.0189 ± 0.0008 Å |
α | 90° |
β | 94.8582 ± 0.0016° |
γ | 90° |
Cell volume | 2844.6 ± 0.2 Å3 |
Cell temperature | 296 ± 2 K |
Ambient diffraction temperature | 296 ± 2 K |
Number of distinct elements | 5 |
Space group number | 14 |
Hermann-Mauguin space group symbol | P 1 21/c 1 |
Hall space group symbol | -P 2ybc |
Residual factor for all reflections | 0.1264 |
Residual factor for significantly intense reflections | 0.0526 |
Weighted residual factors for significantly intense reflections | 0.1023 |
Weighted residual factors for all reflections included in the refinement | 0.1271 |
Goodness-of-fit parameter for all reflections included in the refinement | 1.011 |
Diffraction radiation wavelength | 0.71073 Å |
Diffraction radiation type | MoKα |