Information card for entry 7060532
Formula | C42 H48 O4 S2 |
Calculated formula | C42 H48 O4 S2 |
Title of publication | Regio- and stereoselectivity of spirodienone formation in 2,14-dithiacalix[4]arene |
Authors of publication | Kortus, D.; Eigner, V.; Lhoták, P. |
Journal of publication | New Journal of Chemistry |
Year of publication | 2021 |
Journal volume | 45 |
Journal issue | 19 |
Pages of publication | 8563 - 8571 |
a | 14.194 ± 0.0005 Å |
b | 12.1754 ± 0.0004 Å |
c | 10.6117 ± 0.0004 Å |
α | 90° |
β | 92.5237 ± 0.0015° |
γ | 90° |
Cell volume | 1832.11 ± 0.11 Å3 |
Cell temperature | 180 K |
Ambient diffraction temperature | 180 K |
Ambient diffracton pressure | 101 kPa |
Number of distinct elements | 4 |
Space group number | 14 |
Hermann-Mauguin space group symbol | P 1 21/c 1 |
Hall space group symbol | -P 2ybc |
Residual factor for all reflections | 0.0448 |
Residual factor for significantly intense reflections | 0.0386 |
Weighted residual factors for all reflections | 0.1077 |
Weighted residual factors for significantly intense reflections | 0.1041 |
Weighted residual factors for all reflections included in the refinement | 0.1077 |
Goodness-of-fit parameter for all reflections included in the refinement | 0.9929 |
Diffraction radiation wavelength | 1.54178 Å |
Diffraction radiation type | CuKα |