Information card for entry 7060551
Common name | Yttrium-organic Compound |
Formula | C21 H9 N3 O21 Y2 |
Calculated formula | C21 H9 N3 O21 Y2 |
Title of publication | pH response of a hydroxyl-functionalized luminescent metal‒organic framework based phosphor |
Authors of publication | Hui, Sayani; Majee, Prakash; Singha, Debal Kanti; Daga, Pooja; Mondal, Sudip Kumar; Mahata, Partha |
Journal of publication | New Journal of Chemistry |
Year of publication | 2021 |
Journal volume | 45 |
Journal issue | 21 |
Pages of publication | 9394 - 9402 |
a | 8.9905 ± 0.0007 Å |
b | 14.538 ± 0.001 Å |
c | 21.7767 ± 0.0015 Å |
α | 90° |
β | 90.917 ± 0.002° |
γ | 90° |
Cell volume | 2845.9 ± 0.4 Å3 |
Cell temperature | 273 ± 2 K |
Ambient diffraction temperature | 273 ± 2 K |
Number of distinct elements | 5 |
Space group number | 14 |
Hermann-Mauguin space group symbol | P 1 21/n 1 |
Hall space group symbol | -P 2yn |
Residual factor for all reflections | 0.0466 |
Residual factor for significantly intense reflections | 0.0359 |
Weighted residual factors for significantly intense reflections | 0.0978 |
Weighted residual factors for all reflections included in the refinement | 0.1085 |
Goodness-of-fit parameter for all reflections included in the refinement | 1.096 |
Diffraction radiation wavelength | 0.71073 Å |
Diffraction radiation type | MoKα |