Information card for entry 7060553
Formula | C33 H62 Co Gd N3 O15 |
Calculated formula | C33 H62 Co Gd N3 O15 |
SMILES | [Gd]123456([O]7[Co]8([OH]C)([O]=C(N)N[N]8=Cc8c7c([O]1C)ccc8)([O]3C(=[O]2)C(C)(C)C)[O]=C(C(C)(C)C)O6)([O]=C(O4)C(C)(C)C)OC(=[O]5)C(C)(C)C.OC.OC.OC |
Title of publication | Heterodinuclear [Co-Ln] complexes of semicarbazide-arm bearing ligand: synthesis from the cleavage of starting [Co-Co] complex, structures and magnetic properties |
Authors of publication | Biswas, Mousumi; Basak, Dipmalya; Sañudo, E. Carolina; Ray, Debashis |
Journal of publication | New Journal of Chemistry |
Year of publication | 2021 |
Journal volume | 45 |
Journal issue | 19 |
Pages of publication | 8755 - 8762 |
a | 22.46 ± 0.03 Å |
b | 10.229 ± 0.015 Å |
c | 18.36 ± 0.03 Å |
α | 90° |
β | 90° |
γ | 90° |
Cell volume | 4218 ± 11 Å3 |
Cell temperature | 153.15 K |
Ambient diffraction temperature | 153.15 K |
Number of distinct elements | 6 |
Space group number | 29 |
Hermann-Mauguin space group symbol | P c a 21 |
Hall space group symbol | P 2c -2ac |
Residual factor for all reflections | 0.0439 |
Residual factor for significantly intense reflections | 0.0383 |
Weighted residual factors for significantly intense reflections | 0.0763 |
Weighted residual factors for all reflections included in the refinement | 0.0785 |
Goodness-of-fit parameter for all reflections included in the refinement | 1.072 |
Diffraction radiation wavelength | 0.71073 Å |
Diffraction radiation type | MoKα |