Information card for entry 7060558
Formula | C49 H38 Cu I N2 P2 |
Calculated formula | C49 H38 Cu I N2 P2 |
SMILES | I[Cu]1([P](c2cccc3n(c([n]1c23)c1ccccc1)c1ccccc1)(c1ccccc1)c1ccccc1)[P](c1ccccc1)(c1ccccc1)c1ccccc1 |
Title of publication | Efficiently luminescent mononuclear copper iodide complexes with sterically hindered iminephosphine chelating ligands |
Authors of publication | Zhang, Bin; Zhang, Jie; Sun, Ahui; Liu, Chunmei; Gu, Mengsi; Chen, Yahui; Wei, Bin; Du, Chenxia |
Journal of publication | New Journal of Chemistry |
Year of publication | 2021 |
Journal volume | 45 |
Journal issue | 19 |
Pages of publication | 8763 - 8768 |
a | 17.6455 ± 0.0002 Å |
b | 10.80964 ± 0.00012 Å |
c | 21.9761 ± 0.0003 Å |
α | 90° |
β | 97.1031 ± 0.0011° |
γ | 90° |
Cell volume | 4159.58 ± 0.09 Å3 |
Cell temperature | 293 ± 2 K |
Ambient diffraction temperature | 293 ± 2 K |
Number of distinct elements | 6 |
Space group number | 14 |
Hermann-Mauguin space group symbol | P 1 21/n 1 |
Hall space group symbol | -P 2yn |
Residual factor for all reflections | 0.0454 |
Residual factor for significantly intense reflections | 0.0376 |
Weighted residual factors for significantly intense reflections | 0.0932 |
Weighted residual factors for all reflections included in the refinement | 0.1001 |
Goodness-of-fit parameter for all reflections included in the refinement | 1.028 |
Diffraction radiation probe | x-ray |
Diffraction radiation wavelength | 1.54184 Å |
Diffraction radiation type | CuKα |