Information card for entry 7060569
Formula | C28 H26 Cu N16 O10 |
Calculated formula | C28 H26 Cu N16 O10 |
Title of publication | Regulation of π⋯π stacking interactions between triimidazole luminophores and comprehensive emission quenching by coordination to Cu(ii) |
Authors of publication | Melnic, Elena; Kravtsov, Victor Ch.; Lucenti, Elena; Cariati, Elena; Forni, Alessandra; Siminel, Nikita; Fonari, Marina S. |
Journal of publication | New Journal of Chemistry |
Year of publication | 2021 |
Journal volume | 45 |
Journal issue | 20 |
Pages of publication | 9040 - 9052 |
a | 7.6979 ± 0.0003 Å |
b | 15.6162 ± 0.0012 Å |
c | 13.5766 ± 0.0007 Å |
α | 90° |
β | 91.386 ± 0.005° |
γ | 90° |
Cell volume | 1631.59 ± 0.16 Å3 |
Cell temperature | 293 ± 2 K |
Ambient diffraction temperature | 293 ± 2 K |
Number of distinct elements | 5 |
Space group number | 14 |
Hermann-Mauguin space group symbol | P 1 21/n 1 |
Hall space group symbol | -P 2yn |
Residual factor for all reflections | 0.1253 |
Residual factor for significantly intense reflections | 0.0588 |
Weighted residual factors for significantly intense reflections | 0.0668 |
Weighted residual factors for all reflections included in the refinement | 0.0839 |
Goodness-of-fit parameter for all reflections included in the refinement | 0.894 |
Diffraction radiation wavelength | 0.71073 Å |
Diffraction radiation type | MoKα |