Information card for entry 7060574
Formula | C40.5 H34.5 Cu N27.5 O7.5 |
Calculated formula | C40.5 H34.5 Cu N27.5 O7.5 |
Title of publication | Regulation of π⋯π stacking interactions between triimidazole luminophores and comprehensive emission quenching by coordination to Cu(ii) |
Authors of publication | Melnic, Elena; Kravtsov, Victor Ch.; Lucenti, Elena; Cariati, Elena; Forni, Alessandra; Siminel, Nikita; Fonari, Marina S. |
Journal of publication | New Journal of Chemistry |
Year of publication | 2021 |
Journal volume | 45 |
Journal issue | 20 |
Pages of publication | 9040 - 9052 |
a | 11.5519 ± 0.0004 Å |
b | 22.6083 ± 0.0007 Å |
c | 9.0408 ± 0.0004 Å |
α | 90° |
β | 99.884 ± 0.004° |
γ | 90° |
Cell volume | 2326.13 ± 0.15 Å3 |
Cell temperature | 293 ± 2 K |
Ambient diffraction temperature | 293 ± 2 K |
Number of distinct elements | 5 |
Space group number | 14 |
Hermann-Mauguin space group symbol | P 1 21/c 1 |
Hall space group symbol | -P 2ybc |
Residual factor for all reflections | 0.0829 |
Residual factor for significantly intense reflections | 0.0545 |
Weighted residual factors for significantly intense reflections | 0.139 |
Weighted residual factors for all reflections included in the refinement | 0.1608 |
Goodness-of-fit parameter for all reflections included in the refinement | 1 |
Diffraction radiation wavelength | 0.71073 Å |
Diffraction radiation type | MoKα |