Information card for entry 7060583
Formula | C25 H34 N3 O7 Zn |
Calculated formula | C25 H34 N3 O7 Zn |
Title of publication | Heteroleptic enantiopure Pd(ii)-complexes derived from halogen-substituted Schiff bases and 2-picolylamine: synthesis, experimental and computational characterization and investigation of the influence of chirality and halogen atoms on the anticancer activity |
Authors of publication | Kordestani, Nazanin; Amiri Rudbari, Hadi; Correia, Isabel; Valente, Andreia; Côrte-Real, Leonor; Islam, Mohammad Khairul; Micale, Nicola; Braun, Jason D.; Herbert, David E.; Tumanov, Nikolay; Wouters, Johan; Enamullah, Mohammed |
Journal of publication | New Journal of Chemistry |
Year of publication | 2021 |
Journal volume | 45 |
Journal issue | 20 |
Pages of publication | 9163 - 9180 |
a | 8.3492 ± 0.0003 Å |
b | 12.3145 ± 0.0005 Å |
c | 14.6583 ± 0.0006 Å |
α | 66.874 ± 0.002° |
β | 80.546 ± 0.002° |
γ | 73.791 ± 0.002° |
Cell volume | 1328.36 ± 0.09 Å3 |
Cell temperature | 296 ± 2 K |
Ambient diffraction temperature | 296 ± 2 K |
Number of distinct elements | 5 |
Space group number | 2 |
Hermann-Mauguin space group symbol | P -1 |
Hall space group symbol | -P 1 |
Residual factor for all reflections | 0.046 |
Residual factor for significantly intense reflections | 0.0404 |
Weighted residual factors for significantly intense reflections | 0.1141 |
Weighted residual factors for all reflections included in the refinement | 0.118 |
Goodness-of-fit parameter for all reflections included in the refinement | 1.046 |
Diffraction radiation wavelength | 0.71073 Å |
Diffraction radiation type | MoKα |