Information card for entry 7060625
Common name | hexakis(1-cyclopropyl-5H-tetrazolyl)manganese(II) diperchlorate |
Chemical name | hexakis(1-cyclopropyl-5H-tetrazolyl)manganese(II) diperchlorate |
Formula | C24 H36 Cl2 Mn N24 O8 |
Calculated formula | C24 H36 Cl2 Mn N24 O8 |
Title of publication | Tailoring the properties of 3d transition metal complexes with different N-cycloalkyl-substituted tetrazoles |
Authors of publication | Braun, Vanessa; Wurzenberger, Maximilian H. H.; Weippert, Valentin; Stierstorfer, Jörg |
Journal of publication | New Journal of Chemistry |
Year of publication | 2021 |
Journal volume | 45 |
Journal issue | 25 |
Pages of publication | 11042 - 11050 |
a | 10.888 ± 0.0006 Å |
b | 10.888 ± 0.0006 Å |
c | 29.5174 ± 0.0017 Å |
α | 90° |
β | 90° |
γ | 120° |
Cell volume | 3030.4 ± 0.3 Å3 |
Cell temperature | 106 ± 2 K |
Ambient diffraction temperature | 106 ± 2 K |
Number of distinct elements | 6 |
Space group number | 148 |
Hermann-Mauguin space group symbol | R -3 :H |
Hall space group symbol | -R 3 |
Residual factor for all reflections | 0.0352 |
Residual factor for significantly intense reflections | 0.0293 |
Weighted residual factors for significantly intense reflections | 0.0734 |
Weighted residual factors for all reflections included in the refinement | 0.0768 |
Goodness-of-fit parameter for all reflections included in the refinement | 1.082 |
Diffraction radiation probe | x-ray |
Diffraction radiation wavelength | 0.71073 Å |
Diffraction radiation type | MoKα |