Information card for entry 7060628
Common name | hexakis(1-cyclopropyl-5H-tetrazolyl)zinc(II) diperchlorate |
Chemical name | hexakis(1-cyclopropyl-5H-tetrazolyl)zinc(II) diperchlorate |
Formula | C24 H36 Cl2 N24 O8 Zn |
Calculated formula | C24 H36 Cl2 N24 O8 Zn |
Title of publication | Tailoring the properties of 3d transition metal complexes with different N-cycloalkyl-substituted tetrazoles |
Authors of publication | Braun, Vanessa; Wurzenberger, Maximilian H. H.; Weippert, Valentin; Stierstorfer, Jörg |
Journal of publication | New Journal of Chemistry |
Year of publication | 2021 |
Journal volume | 45 |
Journal issue | 25 |
Pages of publication | 11042 - 11050 |
a | 10.7815 ± 0.0005 Å |
b | 10.7815 ± 0.0005 Å |
c | 29.591 ± 0.0018 Å |
α | 90° |
β | 90° |
γ | 120° |
Cell volume | 2978.9 ± 0.3 Å3 |
Cell temperature | 107 ± 2 K |
Ambient diffraction temperature | 107 ± 2 K |
Number of distinct elements | 6 |
Space group number | 148 |
Hermann-Mauguin space group symbol | R -3 :H |
Hall space group symbol | -R 3 |
Residual factor for all reflections | 0.0567 |
Residual factor for significantly intense reflections | 0.0383 |
Weighted residual factors for significantly intense reflections | 0.0784 |
Weighted residual factors for all reflections included in the refinement | 0.0852 |
Goodness-of-fit parameter for all reflections included in the refinement | 1.015 |
Diffraction radiation probe | x-ray |
Diffraction radiation wavelength | 0.71073 Å |
Diffraction radiation type | MoKα |