Information card for entry 7060642
Formula | C27 H22 Ag F3 N2 O3 S |
Calculated formula | C27 H22 Ag F3 N2 O3 S |
Title of publication | Positive thermal expansion facilitates the formation of argentophilic forces following an order‒disorder phase transition |
Authors of publication | Juneja, Navkiran; Unruh, Daniel K.; Groeneman, Ryan H.; Hutchins, Kristin M. |
Journal of publication | New Journal of Chemistry |
Year of publication | 2021 |
Journal volume | 45 |
Journal issue | 20 |
Pages of publication | 8898 - 8901 |
a | 22.0074 ± 0.0002 Å |
b | 12.597 ± 0.0001 Å |
c | 18.2478 ± 0.0002 Å |
α | 90° |
β | 98.381 ± 0.001° |
γ | 90° |
Cell volume | 5004.76 ± 0.08 Å3 |
Cell temperature | 99.98 ± 0.14 K |
Ambient diffraction temperature | 99.98 ± 0.14 K |
Number of distinct elements | 7 |
Space group number | 15 |
Hermann-Mauguin space group symbol | C 1 2/c 1 |
Hall space group symbol | -C 2yc |
Residual factor for all reflections | 0.0377 |
Residual factor for significantly intense reflections | 0.0367 |
Weighted residual factors for significantly intense reflections | 0.0981 |
Weighted residual factors for all reflections included in the refinement | 0.099 |
Goodness-of-fit parameter for all reflections included in the refinement | 1.053 |
Diffraction radiation probe | x-ray |
Diffraction radiation wavelength | 1.54184 Å |
Diffraction radiation type | CuKα |