Information card for entry 7060669
Chemical name | LInCl2 (Dipp) |
Formula | C43 H67 Cl2 In N3 P2 |
Calculated formula | C43 H67 Cl2 In N3 P2 |
Title of publication | Synthesis and characterization of group 13 dichloride (M = Ga, In), dimethyl (M = Al) and cationic methyl aluminum complexes supported by monoanionic NNN-pincer ligands |
Authors of publication | Chisholm, Desmond T.; Hayes, Paul G. |
Journal of publication | New Journal of Chemistry |
Year of publication | 2021 |
Journal volume | 45 |
Journal issue | 33 |
Pages of publication | 15043 - 15052 |
a | 9.7016 ± 0.0001 Å |
b | 18.3583 ± 0.0001 Å |
c | 25.5187 ± 0.0002 Å |
α | 90° |
β | 99.669 ± 0.001° |
γ | 90° |
Cell volume | 4480.44 ± 0.06 Å3 |
Cell temperature | 102 ± 3 K |
Ambient diffraction temperature | 102 ± 3 K |
Number of distinct elements | 6 |
Space group number | 14 |
Hermann-Mauguin space group symbol | P 1 21/c 1 |
Hall space group symbol | -P 2ybc |
Residual factor for all reflections | 0.0342 |
Residual factor for significantly intense reflections | 0.0295 |
Weighted residual factors for significantly intense reflections | 0.0727 |
Weighted residual factors for all reflections included in the refinement | 0.0749 |
Goodness-of-fit parameter for all reflections included in the refinement | 1.084 |
Diffraction radiation probe | x-ray |
Diffraction radiation wavelength | 1.54184 Å |
Diffraction radiation type | CuKα |