Information card for entry 7060682
Formula | C30 H30 Cl2 N2 Ru |
Calculated formula | C30 H30 Cl2 N2 Ru |
SMILES | [Ru]12345(Cl)(Cl)([n]6cn(c7c6cccc7)C(c6ccccc6)c6ccccc6)[c]6([cH]1[cH]2[c]3([cH]4[cH]56)C(C)C)C |
Title of publication | Half-sandwich Ru(ii) arene complexes bearing benzimidazole ligands for the N-alkylation reaction of aniline with alcohols in a solvent-free medium |
Authors of publication | Çiçek, Metin; Gürbüz, Nevin; Özdemir, Namık; Özdemir, İsmail; İspir, Esin |
Journal of publication | New Journal of Chemistry |
Year of publication | 2021 |
Journal volume | 45 |
Journal issue | 25 |
Pages of publication | 11075 - 11085 |
a | 13.4953 ± 0.0007 Å |
b | 13.5037 ± 0.0006 Å |
c | 15.368 ± 0.0009 Å |
α | 90° |
β | 103.766 ± 0.004° |
γ | 90° |
Cell volume | 2720.2 ± 0.2 Å3 |
Cell temperature | 296 ± 2 K |
Ambient diffraction temperature | 296 ± 2 K |
Number of distinct elements | 5 |
Space group number | 14 |
Hermann-Mauguin space group symbol | P 1 21/c 1 |
Hall space group symbol | -P 2ybc |
Residual factor for all reflections | 0.0572 |
Residual factor for significantly intense reflections | 0.0362 |
Weighted residual factors for significantly intense reflections | 0.0682 |
Weighted residual factors for all reflections included in the refinement | 0.0734 |
Goodness-of-fit parameter for all reflections included in the refinement | 1.01 |
Diffraction radiation wavelength | 0.71073 Å |
Diffraction radiation type | MoKα |