Information card for entry 7060684
Formula | C38 H27 N3 |
Calculated formula | C38 H27 N3 |
SMILES | n1c(c(nc2c1ccc(c1ccc(N(c3ccccc3)c3ccccc3)cc1)c2)c1ccccc1)c1ccccc1 |
Title of publication | Light-emitting analogues based on triphenylamine modified quinoxaline and pyridine[2,3-b]pyrazine exhibiting different mechanochromic luminescence |
Authors of publication | Ge, Yuxi; Huang, Bin |
Journal of publication | New Journal of Chemistry |
Year of publication | 2021 |
Journal volume | 45 |
Journal issue | 25 |
Pages of publication | 11304 - 11312 |
a | 19.2398 ± 0.0013 Å |
b | 8.8918 ± 0.0006 Å |
c | 18.0426 ± 0.0009 Å |
α | 90° |
β | 116.868 ± 0.002° |
γ | 90° |
Cell volume | 2753.5 ± 0.3 Å3 |
Cell temperature | 150 K |
Ambient diffraction temperature | 150 K |
Number of distinct elements | 3 |
Space group number | 14 |
Hermann-Mauguin space group symbol | P 1 21/c 1 |
Hall space group symbol | -P 2ybc |
Residual factor for all reflections | 0.0971 |
Residual factor for significantly intense reflections | 0.0492 |
Weighted residual factors for significantly intense reflections | 0.1037 |
Weighted residual factors for all reflections included in the refinement | 0.1278 |
Goodness-of-fit parameter for all reflections included in the refinement | 1.027 |
Diffraction radiation wavelength | 0.71073 Å |
Diffraction radiation type | MoKα |