Information card for entry 7060687
Formula | C37 H26 N4 |
Calculated formula | C37 H26 N4 |
SMILES | n1c2ncc(c3ccc(N(c4ccccc4)c4ccccc4)cc3)cc2nc(c2ccccc2)c1c1ccccc1 |
Title of publication | Light-emitting analogues based on triphenylamine modified quinoxaline and pyridine[2,3-b]pyrazine exhibiting different mechanochromic luminescence |
Authors of publication | Ge, Yuxi; Huang, Bin |
Journal of publication | New Journal of Chemistry |
Year of publication | 2021 |
Journal volume | 45 |
Journal issue | 25 |
Pages of publication | 11304 - 11312 |
a | 19.065 ± 0.014 Å |
b | 8.994 ± 0.007 Å |
c | 17.864 ± 0.014 Å |
α | 90° |
β | 116.751 ± 0.013° |
γ | 90° |
Cell volume | 2735 ± 4 Å3 |
Cell temperature | 296.15 K |
Ambient diffraction temperature | 296.15 K |
Number of distinct elements | 3 |
Space group number | 14 |
Hermann-Mauguin space group symbol | P 1 21/c 1 |
Hall space group symbol | -P 2ybc |
Residual factor for all reflections | 0.1393 |
Residual factor for significantly intense reflections | 0.0591 |
Weighted residual factors for significantly intense reflections | 0.1389 |
Weighted residual factors for all reflections included in the refinement | 0.1814 |
Goodness-of-fit parameter for all reflections included in the refinement | 0.97 |
Diffraction radiation wavelength | 0.71073 Å |
Diffraction radiation type | MoKα |