Information card for entry 7060704
Formula | C13 H15 N5 S |
Calculated formula | C13 H15 N5 S |
Title of publication | Arylbiamidines: synthesis and structural studies en route to anticancer applications |
Authors of publication | Grytsai, Oleksandr; Gonçalves, Leticia Christina Pires; Bardovskyi, Rostyslav; Hamouda-Tekaya, Nedra; Rocchi, Stéphane; Ronco, Cyril; Benhida, Rachid |
Journal of publication | New Journal of Chemistry |
Year of publication | 2021 |
Journal volume | 45 |
Journal issue | 27 |
Pages of publication | 11893 - 11897 |
a | 9.8884 ± 0.0004 Å |
b | 10.9455 ± 0.0005 Å |
c | 12.6252 ± 0.0005 Å |
α | 90° |
β | 91.519 ± 0.004° |
γ | 90° |
Cell volume | 1365.99 ± 0.1 Å3 |
Cell temperature | 295 K |
Ambient diffraction temperature | 295 K |
Number of distinct elements | 4 |
Space group number | 14 |
Hermann-Mauguin space group symbol | P 1 21/c 1 |
Hall space group symbol | -P 2ybc |
Residual factor for all reflections | 0.0618 |
Residual factor for significantly intense reflections | 0.0436 |
Weighted residual factors for significantly intense reflections | 0.1128 |
Weighted residual factors for all reflections included in the refinement | 0.1294 |
Goodness-of-fit parameter for all reflections included in the refinement | 1.025 |
Diffraction radiation probe | x-ray |
Diffraction radiation wavelength | 1.54184 Å |
Diffraction radiation type | CuKα |