Information card for entry 7060707
Formula | C22 H26 Cl N3 Ni O2 |
Calculated formula | C22 H26 Cl N3 Ni O2 |
SMILES | [Ni]12(N(c3c(C4=[N]1[C@H](CO4)Cc1ccccc1)cccc3)C(=O)C[N]2(CC)CC)Cl |
Title of publication | Achiral and chiral NNN-pincer nickel complexes with oxazolinyl backbones: application in transfer hydrogenation of ketones |
Authors of publication | Jagtap, Rahul A.; Ankade, Shidheshwar B.; Gonnade, Rajesh G.; Punji, Benudhar |
Journal of publication | New Journal of Chemistry |
Year of publication | 2021 |
Journal volume | 45 |
Journal issue | 27 |
Pages of publication | 11927 - 11936 |
a | 9.9695 ± 0.0004 Å |
b | 10.0137 ± 0.0003 Å |
c | 21.4431 ± 0.0007 Å |
α | 90° |
β | 90° |
γ | 90° |
Cell volume | 2140.7 ± 0.13 Å3 |
Cell temperature | 100 ± 2 K |
Ambient diffraction temperature | 100 ± 2 K |
Number of distinct elements | 6 |
Space group number | 19 |
Hermann-Mauguin space group symbol | P 21 21 21 |
Hall space group symbol | P 2ac 2ab |
Residual factor for all reflections | 0.0338 |
Residual factor for significantly intense reflections | 0.0264 |
Weighted residual factors for significantly intense reflections | 0.0557 |
Weighted residual factors for all reflections included in the refinement | 0.0585 |
Goodness-of-fit parameter for all reflections included in the refinement | 1.036 |
Diffraction radiation wavelength | 0.71073 Å |
Diffraction radiation type | MoKα |