Information card for entry 7060711
Formula | C44 H54 N10 O9 Zn3 |
Calculated formula | C44 H54 N10 O9 Zn3 |
Title of publication | A trinuclear Zn(ii) Schiff base azido compound: synthesis, structure and exploration of antimicrobial activity |
Authors of publication | Ghosh, Mrinmoy; Biswas, Samik; Roy, Moumita; Biswas, Saptarshi; Ghosh, Pameli; Koner, Subratanath; Mandal, Supratim; Saha, Sandip |
Journal of publication | New Journal of Chemistry |
Year of publication | 2021 |
Journal volume | 45 |
Journal issue | 27 |
Pages of publication | 12296 - 12304 |
a | 15.6822 ± 0.0014 Å |
b | 15.7587 ± 0.0014 Å |
c | 19.2295 ± 0.0017 Å |
α | 90° |
β | 100.549 ± 0.003° |
γ | 90° |
Cell volume | 4671.9 ± 0.7 Å3 |
Cell temperature | 293 ± 2 K |
Ambient diffraction temperature | 293 ± 2 K |
Number of distinct elements | 5 |
Space group number | 15 |
Hermann-Mauguin space group symbol | C 1 2/c 1 |
Hall space group symbol | -C 2yc |
Residual factor for all reflections | 0.0316 |
Residual factor for significantly intense reflections | 0.0248 |
Weighted residual factors for significantly intense reflections | 0.0629 |
Weighted residual factors for all reflections included in the refinement | 0.0684 |
Goodness-of-fit parameter for all reflections included in the refinement | 1.068 |
Diffraction radiation wavelength | 0.71073 Å |
Diffraction radiation type | MoKα |