Information card for entry 7061083
Formula | C34 H28 O6 Sn |
Calculated formula | C34 H28 O6 Sn |
Title of publication | Water stable fluorescent organotin(iv) compounds: aggregation induced emission enhancement and recognition of lead ions in an aqueous system |
Authors of publication | Kaur, Kulwinder; Singh, Raghubir; Kaur, Varinder; Capalash, Neena |
Journal of publication | New Journal of Chemistry |
Year of publication | 2022 |
Journal volume | 46 |
Journal issue | 1 |
Pages of publication | 148 - 161 |
a | 11.5018 ± 0.0003 Å |
b | 14.9532 ± 0.0003 Å |
c | 17.597 ± 0.0005 Å |
α | 90° |
β | 99.344 ± 0.002° |
γ | 90° |
Cell volume | 2986.33 ± 0.13 Å3 |
Cell temperature | 298 ± 2 K |
Ambient diffraction temperature | 298 ± 2 K |
Number of distinct elements | 4 |
Space group number | 14 |
Hermann-Mauguin space group symbol | P 1 21/c 1 |
Hall space group symbol | -P 2ybc |
Residual factor for all reflections | 0.0621 |
Residual factor for significantly intense reflections | 0.0489 |
Weighted residual factors for significantly intense reflections | 0.1458 |
Weighted residual factors for all reflections included in the refinement | 0.1565 |
Goodness-of-fit parameter for all reflections included in the refinement | 1.075 |
Diffraction radiation probe | x-ray |
Diffraction radiation wavelength | 0.71073 Å |
Diffraction radiation type | MoKα |