Information card for entry 7061260
Formula | C18 H18 N2 Ni O3 |
Calculated formula | C18 H18 N2 Ni O3 |
Title of publication | Templated synthesis of Ni(ii) complexes of unsymmetrical Schiff base ligands derived from 1,3-diamino-2-propanol: structural diversity and magnetic properties |
Authors of publication | Bhunia, Pradip; Maity, Souvik; Mayans, Júlia; Ghosh, Ashutosh |
Journal of publication | New Journal of Chemistry |
Year of publication | 2022 |
Journal volume | 46 |
Journal issue | 9 |
Pages of publication | 4363 - 4372 |
a | 7.7952 ± 0.0001 Å |
b | 18.669 ± 0.0003 Å |
c | 10.9834 ± 0.0002 Å |
α | 90° |
β | 94.348 ± 0.001° |
γ | 90° |
Cell volume | 1593.8 ± 0.04 Å3 |
Cell temperature | 296 ± 2 K |
Ambient diffraction temperature | 296.15 K |
Number of distinct elements | 5 |
Space group number | 14 |
Hermann-Mauguin space group symbol | P 1 21/c 1 |
Hall space group symbol | -P 2ybc |
Residual factor for all reflections | 0.0338 |
Residual factor for significantly intense reflections | 0.0308 |
Weighted residual factors for significantly intense reflections | 0.0791 |
Weighted residual factors for all reflections included in the refinement | 0.0807 |
Goodness-of-fit parameter for all reflections included in the refinement | 1.145 |
Diffraction radiation wavelength | 0.71073 Å |
Diffraction radiation type | MoKα |