Information card for entry 7061262
Formula | C56.4 H58.81 N10 Ni6 O16 |
Calculated formula | C56.403 H58.806 N10 Ni6 O16 |
Title of publication | Templated synthesis of Ni(ii) complexes of unsymmetrical Schiff base ligands derived from 1,3-diamino-2-propanol: structural diversity and magnetic properties |
Authors of publication | Bhunia, Pradip; Maity, Souvik; Mayans, Júlia; Ghosh, Ashutosh |
Journal of publication | New Journal of Chemistry |
Year of publication | 2022 |
Journal volume | 46 |
Journal issue | 9 |
Pages of publication | 4363 - 4372 |
a | 28.199 ± 0.004 Å |
b | 15.467 ± 0.002 Å |
c | 17.513 ± 0.002 Å |
α | 90° |
β | 99.674 ± 0.005° |
γ | 90° |
Cell volume | 7529.7 ± 1.7 Å3 |
Cell temperature | 296 ± 2 K |
Ambient diffraction temperature | 296.15 K |
Number of distinct elements | 5 |
Space group number | 14 |
Hermann-Mauguin space group symbol | P 1 21/c 1 |
Hall space group symbol | -P 2ybc |
Residual factor for all reflections | 0.1014 |
Residual factor for significantly intense reflections | 0.0547 |
Weighted residual factors for significantly intense reflections | 0.1328 |
Weighted residual factors for all reflections included in the refinement | 0.1586 |
Goodness-of-fit parameter for all reflections included in the refinement | 0.974 |
Diffraction radiation wavelength | 0.71073 Å |
Diffraction radiation type | MoKα |