Information card for entry 7062482
Formula | C168 H350.5 Cl3 Cu3 N6 O85.25 P6 Ti18 |
Calculated formula | C162 H324 Cl3 Cu3 N6 O78 P6 Ti18 |
Title of publication | Ligand-directed structure evolution from a titanium-oxo cluster to coordination capsule and one-dimensional coordination polymer based on {Ti3O} units |
Authors of publication | Meng, Min; Liao, Lingrong; Zheng, Qi; Xuan, Weimin |
Journal of publication | New Journal of Chemistry |
Year of publication | 2023 |
Journal volume | 47 |
Journal issue | 23 |
Pages of publication | 11312 - 11317 |
a | 27.5953 ± 0.0007 Å |
b | 19.5028 ± 0.0005 Å |
c | 47.0477 ± 0.0012 Å |
α | 90° |
β | 92.516 ± 0.001° |
γ | 90° |
Cell volume | 25296 ± 1.1 Å3 |
Cell temperature | 150 K |
Ambient diffraction temperature | 150 K |
Number of distinct elements | 8 |
Space group number | 15 |
Hermann-Mauguin space group symbol | C 1 2/c 1 |
Hall space group symbol | -C 2yc |
Residual factor for all reflections | 0.1103 |
Residual factor for significantly intense reflections | 0.0986 |
Weighted residual factors for significantly intense reflections | 0.2821 |
Weighted residual factors for all reflections included in the refinement | 0.294 |
Goodness-of-fit parameter for all reflections included in the refinement | 1.074 |
Diffraction radiation wavelength | 1.54184 Å |
Diffraction radiation type | CuKα |