Information card for entry 7063345
Chemical name | N-(3-(bromomethyl)-7,7-dimethylbicyclo[2.2.1]heptan-2-yl)-N'-((trifluoromethyl)sulfonyl)acetamidamide |
Formula | C13 H20 Br F3 N2 O2 S |
Calculated formula | C13 H20 Br F3 N2 O2 S |
Title of publication | Halosulfonamidation of camphene: chemo and stereoselectivity, rearrangement, solvent interception, heterocyclization |
Authors of publication | Moskalik, Mikhail Yu.; Garagan, Ivan A.; Shainyan, Bagrat A.; Yarovaya, Olga I.; Ganin, Anton S.; Astakhova, Vera V.; Sterkhova, Irina V.; Zinchenko, Sergey V.; Salakhutdinov, Nariman F.; Radzhabov, Amirbek D. |
Journal of publication | New Journal of Chemistry |
Year of publication | 2024 |
Journal volume | 48 |
Journal issue | 30 |
Pages of publication | 13506 - 13513 |
a | 10.233 ± 0.004 Å |
b | 12.379 ± 0.004 Å |
c | 13.802 ± 0.004 Å |
α | 90° |
β | 105.009 ± 0.013° |
γ | 90° |
Cell volume | 1688.7 ± 1 Å3 |
Cell temperature | 293 ± 2 K |
Ambient diffraction temperature | 293 ± 2 K |
Number of distinct elements | 7 |
Space group number | 14 |
Hermann-Mauguin space group symbol | P 1 21/c 1 |
Hall space group symbol | -P 2ybc |
Residual factor for all reflections | 0.1864 |
Residual factor for significantly intense reflections | 0.0929 |
Weighted residual factors for significantly intense reflections | 0.2417 |
Weighted residual factors for all reflections included in the refinement | 0.2728 |
Goodness-of-fit parameter for all reflections included in the refinement | 1.058 |
Diffraction radiation wavelength | 0.71073 Å |
Diffraction radiation type | MoKα |