Information card for entry 7063367
Formula | C59 H75 N6 S2 Si4 Y2 |
Calculated formula | C59 H75 N6 S2 Si4 Y2 |
Title of publication | Difunctionalized indol-2-yl-ligated bimetallic rare-earth metal complexes: synthesis, characterization and high activity towards polymerization of 2-vinylpyridine |
Authors of publication | Zhao, Zhiwei; Tong, Yao; Liu, ChenCheng; Huang, Zeming; Wang, Shaowu; Wang, Fenhua |
Journal of publication | New Journal of Chemistry |
Year of publication | 2024 |
Journal volume | 48 |
Journal issue | 33 |
Pages of publication | 14690 - 14696 |
a | 12.4938 ± 0.0014 Å |
b | 15.7972 ± 0.0018 Å |
c | 17.7519 ± 0.0019 Å |
α | 88.681 ± 0.002° |
β | 84.851 ± 0.002° |
γ | 69.397 ± 0.002° |
Cell volume | 3266.2 ± 0.6 Å3 |
Cell temperature | 296.15 ± 0.1 K |
Ambient diffraction temperature | 296.15 K |
Number of distinct elements | 6 |
Space group number | 2 |
Hermann-Mauguin space group symbol | P -1 |
Hall space group symbol | -P 1 |
Residual factor for all reflections | 0.104 |
Residual factor for significantly intense reflections | 0.0504 |
Weighted residual factors for significantly intense reflections | 0.0928 |
Weighted residual factors for all reflections included in the refinement | 0.1114 |
Goodness-of-fit parameter for all reflections included in the refinement | 1.009 |
Diffraction radiation wavelength | 0.71073 Å |
Diffraction radiation type | MoKα |