Information card for entry 7063372
Formula | C21 H25 N7 O6 U |
Calculated formula | C21 H25 N7 O6 U |
Title of publication | Spectroscopically labelled hydroxylamino-triazine (BHT) siderophores toward the quantification of iron(iii), vanadium(v) and uranium(vi) hard metal ions |
Authors of publication | Amoiridis, Angelos; Papanikolaou, Michael; Drouza, Chryssoula; Kabanos, Themistoklis A.; Keramidas, Anastasios D. |
Journal of publication | New Journal of Chemistry |
Year of publication | 2024 |
Journal volume | 48 |
Journal issue | 34 |
Pages of publication | 14884 - 14895 |
a | 10.3994 ± 0.0001 Å |
b | 10.407 ± 0.0001 Å |
c | 11.9303 ± 0.0001 Å |
α | 109.315 ± 0.001° |
β | 93.685 ± 0.001° |
γ | 94.307 ± 0.001° |
Cell volume | 1209.6 ± 0.02 Å3 |
Cell temperature | 293 ± 2 K |
Ambient diffraction temperature | 293 ± 2 K |
Number of distinct elements | 5 |
Space group number | 2 |
Hermann-Mauguin space group symbol | P -1 |
Hall space group symbol | -P 1 |
Residual factor for all reflections | 0.0161 |
Residual factor for significantly intense reflections | 0.0161 |
Weighted residual factors for significantly intense reflections | 0.0401 |
Weighted residual factors for all reflections included in the refinement | 0.0401 |
Goodness-of-fit parameter for all reflections included in the refinement | 1.169 |
Diffraction radiation probe | x-ray |
Diffraction radiation wavelength | 1.54184 Å |
Diffraction radiation type | CuKα |