Information card for entry 7063400
Formula | C21 H13 B F5 N3 |
Calculated formula | C21 H13 B F5 N3 |
Title of publication | Pyridyl-BODIPY dyes: synthesis, optical properties and adsorption on CdSe quantum dots |
Authors of publication | Martyanova, Elena G.; Martyanov, Timofey P.; Tomilin, Denis N.; Ushakov, Igor A.; Korchagin, Denis V.; Spirin, Maxim G.; Razumov, Vladimir F.; Sobenina, Lyubov N.; Trofimov, Boris A. |
Journal of publication | New Journal of Chemistry |
Year of publication | 2024 |
Journal volume | 48 |
Journal issue | 34 |
Pages of publication | 15036 - 15044 |
a | 22.1534 ± 0.0007 Å |
b | 7.4412 ± 0.0002 Å |
c | 23.4217 ± 0.0007 Å |
α | 90° |
β | 113.902 ± 0.004° |
γ | 90° |
Cell volume | 3529.9 ± 0.2 Å3 |
Cell temperature | 100 ± 0.1 K |
Ambient diffraction temperature | 100 ± 0.1 K |
Number of distinct elements | 5 |
Space group number | 14 |
Hermann-Mauguin space group symbol | P 1 21/n 1 |
Hall space group symbol | -P 2yn |
Residual factor for all reflections | 0.062 |
Residual factor for significantly intense reflections | 0.042 |
Weighted residual factors for significantly intense reflections | 0.0964 |
Weighted residual factors for all reflections included in the refinement | 0.1055 |
Goodness-of-fit parameter for all reflections included in the refinement | 1.042 |
Diffraction radiation wavelength | 0.7107 Å |
Diffraction radiation type | MoKα |