Information card for entry 7063417
Formula | C14 H13 Au2 Cl6 N3 |
Calculated formula | C14 H13 Au2 Cl6 N3 |
Title of publication | Structure-based design to explore the anticancer efficacy of organometallic Pt(ii)- and Au(iii)-N-heterocyclic carbene (NHC) complexes |
Authors of publication | Das, Pooja; Roy, Sraddhya; Das, Chaitali; Biswas, Raju; Chaterjee, Nabanita; Dinda, Joydev |
Journal of publication | New Journal of Chemistry |
Year of publication | 2024 |
Journal volume | 48 |
Journal issue | 37 |
Pages of publication | 16189 - 16201 |
a | 17.5971 ± 0.0005 Å |
b | 7.7989 ± 0.0002 Å |
c | 15.1023 ± 0.0004 Å |
α | 90° |
β | 100.622 ± 0.001° |
γ | 90° |
Cell volume | 2037.09 ± 0.1 Å3 |
Cell temperature | 293 ± 2 K |
Ambient diffraction temperature | 293 ± 2 K |
Number of distinct elements | 5 |
Space group number | 14 |
Hermann-Mauguin space group symbol | P 1 21/c 1 |
Hall space group symbol | -P 2ybc |
Residual factor for all reflections | 0.0392 |
Residual factor for significantly intense reflections | 0.03 |
Weighted residual factors for significantly intense reflections | 0.063 |
Weighted residual factors for all reflections included in the refinement | 0.0667 |
Goodness-of-fit parameter for all reflections included in the refinement | 1.043 |
Diffraction radiation wavelength | 0.71073 Å |
Diffraction radiation type | MoKα |