Information card for entry 7063435
Formula | C36 H40 Cu N2 O2 |
Calculated formula | C36 H40 Cu N2 O2 |
Title of publication | Synthesis and characterization of copper(ii) complexes: their catalytic behavior towards alcohol oxidation using NaOCl as the oxidant |
Authors of publication | Roy, Suparna; Barma, Arpita; Muhuri, Debasmita; Ghosh, Pritam; Roy, Partha |
Journal of publication | New Journal of Chemistry |
Year of publication | 2024 |
Journal volume | 48 |
Journal issue | 34 |
Pages of publication | 14948 - 14957 |
a | 5.616 ± 0.0016 Å |
b | 11.962 ± 0.003 Å |
c | 12.004 ± 0.004 Å |
α | 113.799 ± 0.009° |
β | 91.846 ± 0.01° |
γ | 100.923 ± 0.009° |
Cell volume | 719.2 ± 0.4 Å3 |
Cell temperature | 144 ± 2 K |
Ambient diffraction temperature | 144 ± 2 K |
Number of distinct elements | 5 |
Space group number | 2 |
Hermann-Mauguin space group symbol | P -1 |
Hall space group symbol | -P 1 |
Residual factor for all reflections | 0.0763 |
Residual factor for significantly intense reflections | 0.0485 |
Weighted residual factors for significantly intense reflections | 0.0897 |
Weighted residual factors for all reflections included in the refinement | 0.1034 |
Goodness-of-fit parameter for all reflections included in the refinement | 1.068 |
Diffraction radiation wavelength | 0.71073 Å |
Diffraction radiation type | MoKα |