Information card for entry 7063465
Chemical name |
Indium Nickel (1/2) |
Formula |
In Ni2 |
Calculated formula |
In Ni2 |
Title of publication |
Advancing understanding of comparison of M-O covalency in isostructural M-OSiMe3 (M = Ce, Th, U) complexes |
Authors of publication |
Liu, Kang; Chi, Xiao-Wang; Guo, Yan; Hu, Kongqiu; Mei, Lei; Yu, Jipan; Shi, Weiqun |
Journal of publication |
New Journal of Chemistry |
Year of publication |
2024 |
a |
4.1889 Å |
b |
4.1889 Å |
c |
5.123 Å |
α |
90° |
β |
90° |
γ |
120° |
Cell volume |
77.849 Å3 |
Number of distinct elements |
2 |
Space group number |
194 |
Hermann-Mauguin space group symbol |
P 63/m m c |
Hall space group symbol |
-P 6c 2c |
Yes |
No |
No |