Information card for entry 7063492
Formula | C9 H10 Cu N2 O7 |
Calculated formula | C9 H10 Cu N2 O7 |
Title of publication | Synthesis, Structural Analysis, DFT Study, and Catalytic Performance of a Glycine-Schiff Base Binuclear Copper(II) Complex |
Authors of publication | López-Gastelum, Karla Alejandra; Chávez-Urías, Iván-Fernando; López González, Luis Enrique; Garcia, Juventino J.; Flores-Alamo, Marcos; Morales-Morales, David; Galindo, Jordi R.; Sugich-Miranda, Rocio; Medrano, Felipe; Velazquez-Contreras, Erique F; ROCHA-ALONZO, FERNANDO |
Journal of publication | New Journal of Chemistry |
Year of publication | 2024 |
a | 5.1877 ± 0.0007 Å |
b | 9.1943 ± 0.0014 Å |
c | 12.1179 ± 0.0017 Å |
α | 97.507 ± 0.012° |
β | 92.846 ± 0.012° |
γ | 101.614 ± 0.012° |
Cell volume | 559.59 ± 0.14 Å3 |
Cell temperature | 130 ± 2 K |
Ambient diffraction temperature | 130 ± 2 K |
Number of distinct elements | 5 |
Space group number | 2 |
Hermann-Mauguin space group symbol | P -1 |
Hall space group symbol | -P 1 |
Residual factor for all reflections | 0.0508 |
Residual factor for significantly intense reflections | 0.0398 |
Weighted residual factors for significantly intense reflections | 0.0845 |
Weighted residual factors for all reflections included in the refinement | 0.0934 |
Goodness-of-fit parameter for all reflections included in the refinement | 1.079 |
Diffraction radiation wavelength | 0.71073 Å |
Diffraction radiation type | MoKα |