Information card for entry 7063501
Formula |
C16 H19 N O2 |
Calculated formula |
C16 H19 N O2 |
Title of publication |
Photoluminescent lanthanide(iii) coordination polymers based on 2-{[(4-methylphenyl)amino]methylene}-5,5-dimethylcyclohexane-1,3-dione |
Authors of publication |
Smirnova, Ksenia S.; Sanzhenakova, Elizaveta A.; Eltsov, Ilia V.; Pozdnyakov, Ivan P.; Russkikh, Alena A.; Dotsenko, Victor V.; Lider, Elizaveta V. |
Journal of publication |
New Journal of Chemistry |
Year of publication |
2024 |
a |
11.8139 ± 0.001 Å |
b |
5.8067 ± 0.0004 Å |
c |
20.3464 ± 0.0013 Å |
α |
90° |
β |
100.245 ± 0.004° |
γ |
90° |
Cell volume |
1373.5 ± 0.17 Å3 |
Cell temperature |
150 K |
Ambient diffraction temperature |
150 K |
Number of distinct elements |
4 |
Space group number |
14 |
Hermann-Mauguin space group symbol |
P 1 21/c 1 |
Hall space group symbol |
-P 2ybc |
Residual factor for all reflections |
0.095 |
Residual factor for significantly intense reflections |
0.058 |
Weighted residual factors for significantly intense reflections |
0.1355 |
Weighted residual factors for all reflections included in the refinement |
0.1602 |
Goodness-of-fit parameter for all reflections included in the refinement |
1.058 |
Diffraction radiation wavelength |
0.71073 Å |
Diffraction radiation type |
MoKα |
Yes |
No |
No |