Information card for entry 7063532
Chemical name | Bis[4-ethyl-3-hydroxy-5-methylthiazole-2(3H)-thionolato]zinc(II) |
Formula | C12 H16 N2 O2 S4 Zn |
Calculated formula | C12 H16 N2 O2 S4 Zn |
Title of publication | Synthesis, crystal structure, and insulin-mimetic activity of zinc(II) complexes with 4-alkyl- and 4,5-dialkyl-3-hydroxythiazole-2(3H)-thiones as a new class of hypoglycemic agent candidates |
Authors of publication | Saito, Ryota; Naito, Yuki; Yoshikawa, Yutaka; Yasui, Hiroyuki; Kikkawa, Shoko; Ju, Huiyeong; Ohba, Rintaro; Miyamoto, Tae; Sano, Shogo; Maeda, Kazuya; Tamura, Mako; Azumaya, Isao |
Journal of publication | New Journal of Chemistry |
Year of publication | 2024 |
a | 7.5733 ± 0.0016 Å |
b | 8.7066 ± 0.0019 Å |
c | 13.442 ± 0.003 Å |
α | 78.741 ± 0.002° |
β | 74.963 ± 0.002° |
γ | 88.673 ± 0.003° |
Cell volume | 839.2 ± 0.3 Å3 |
Cell temperature | 120 ± 2 K |
Ambient diffraction temperature | 120 ± 2 K |
Number of distinct elements | 6 |
Space group number | 2 |
Hermann-Mauguin space group symbol | P -1 |
Hall space group symbol | -P 1 |
Residual factor for all reflections | 0.0609 |
Residual factor for significantly intense reflections | 0.0376 |
Weighted residual factors for significantly intense reflections | 0.0844 |
Weighted residual factors for all reflections included in the refinement | 0.0963 |
Goodness-of-fit parameter for all reflections included in the refinement | 1.006 |
Diffraction radiation wavelength | 0.71073 Å |
Diffraction radiation type | MoKα |