Information card for entry 7063534
Chemical name | Bis[3-hydroxy-4,5-dimethyl-2-thioxo-3-thiazololato]zinc(II) |
Formula | C15 H17 N3 O2 S4 Zn |
Calculated formula | C15 H17 N3 O2 S4 Zn |
Title of publication | Synthesis, crystal structure, and insulin-mimetic activity of zinc(II) complexes with 4-alkyl- and 4,5-dialkyl-3-hydroxythiazole-2(3H)-thiones as a new class of hypoglycemic agent candidates |
Authors of publication | Saito, Ryota; Naito, Yuki; Yoshikawa, Yutaka; Yasui, Hiroyuki; Kikkawa, Shoko; Ju, Huiyeong; Ohba, Rintaro; Miyamoto, Tae; Sano, Shogo; Maeda, Kazuya; Tamura, Mako; Azumaya, Isao |
Journal of publication | New Journal of Chemistry |
Year of publication | 2024 |
a | 8.3806 ± 0.0003 Å |
b | 13.3652 ± 0.0004 Å |
c | 9.0229 ± 0.0003 Å |
α | 90° |
β | 103.793 ± 0.0004° |
γ | 90° |
Cell volume | 981.5 ± 0.06 Å3 |
Cell temperature | 120 K |
Ambient diffraction temperature | 120 K |
Number of distinct elements | 6 |
Space group number | 4 |
Hermann-Mauguin space group symbol | P 1 21 1 |
Hall space group symbol | P 2yb |
Residual factor for all reflections | 0.0169 |
Residual factor for significantly intense reflections | 0.0168 |
Weighted residual factors for significantly intense reflections | 0.0444 |
Weighted residual factors for all reflections included in the refinement | 0.0445 |
Goodness-of-fit parameter for all reflections included in the refinement | 1.064 |
Diffraction radiation wavelength | 0.71073 Å |
Diffraction radiation type | MoKα |