Information card for entry 7102328
Formula | C132 H204 N52 O12 Zn16 |
Calculated formula | C132 H204 N52 O12 Zn16 |
Title of publication | Unique formation of two high-nuclearity metallamacrocycles from a mononuclear complex [Zn(dmpzdtc)2] (dmpzdtc=3,5-dimethylpyrazole-1-dithiocarboxylate) via CS2 elimination. |
Authors of publication | Li, Hong-Xi; Wu, Hua-Zhou; Zhang, Wen-Hua; Ren, Zhi-Gang; Zhang, Yong; Lang, Jian-Ping |
Journal of publication | Chemical communications (Cambridge, England) |
Year of publication | 2007 |
Journal issue | 47 |
Pages of publication | 5052 - 5054 |
a | 27.083 ± 0.004 Å |
b | 27.083 ± 0.004 Å |
c | 14.675 ± 0.003 Å |
α | 90° |
β | 90° |
γ | 90° |
Cell volume | 10764 ± 3 Å3 |
Cell temperature | 193 ± 2 K |
Ambient diffraction temperature | 193 ± 2 K |
Number of distinct elements | 5 |
Space group number | 104 |
Hermann-Mauguin space group symbol | P 4 n c |
Hall space group symbol | P 4 -2n |
Residual factor for all reflections | 0.0707 |
Residual factor for significantly intense reflections | 0.0624 |
Weighted residual factors for significantly intense reflections | 0.1615 |
Weighted residual factors for all reflections included in the refinement | 0.1666 |
Goodness-of-fit parameter for all reflections included in the refinement | 1.11 |
Diffraction radiation wavelength | 0.71073 Å |
Diffraction radiation type | MoKα |