Information card for entry 7109176
Chemical name |
Ag (S3 N2 O)2 As F6 |
Formula |
Ag As F6 N4 O2 S6 |
Calculated formula |
Ag As F6 N4 O2 S6 |
Title of publication |
X-Ray Crystal Structure of Bis(1-oxo-1-lambda 4,2,4-lambda 4,3,5-trithiadiazole)silver Hexafluoroarsenate(V); an Unusual Mode of Co-ordination |
Authors of publication |
Schmidt, M.; Sheldrick, G.M.; Schimkowiak, J.; Thomas, M.; Roesky, H.W.; Noltemeyer, M. |
Journal of publication |
Journal of the Chemical Society. Chemical Communications (1972-) |
Year of publication |
1982 |
Journal volume |
1982 |
Pages of publication |
790 - 791 |
a |
9.2029 Å |
b |
10.217 Å |
c |
14.8359 Å |
α |
90° |
β |
90° |
γ |
90° |
Cell volume |
1394.96 Å3 |
Number of distinct elements |
6 |
Space group number |
54 |
Hermann-Mauguin space group symbol |
P c c a |
Hall space group symbol |
-P 2a 2ac |
Yes |
No |
No |