Information card for entry 7110679
Formula | C49 H58 Cd Cl3 N Pt |
Calculated formula | C48.99 H20 Cd Cl3.02 N Pt |
Title of publication | Synthesis, structural characterisation and luminescence studies of the first alkynyl stabilised platinum‒cadmium complexes |
Authors of publication | Charmant, J. P. H.; Gómez, J.; Orpen, A. G.; Falvello, L. R.; Forniés, J.; Rueda, A.; Gómez, J.; Lalinde, E.; Moreno, M. T. |
Journal of publication | Chemical Communications |
Year of publication | 1999 |
Journal issue | 20 |
Pages of publication | 2045 |
a | 20.49 ± 0.005 Å |
b | 16.33 ± 0.007 Å |
c | 16.311 ± 0.004 Å |
α | 90° |
β | 120.013 ± 0.016° |
γ | 90° |
Cell volume | 4726 ± 3 Å3 |
Cell temperature | 173 ± 2 K |
Ambient diffraction temperature | 173 ± 2 K |
Number of distinct elements | 6 |
Space group number | 12 |
Hermann-Mauguin space group symbol | C 1 2/m 1 |
Hall space group symbol | -C 2y |
Residual factor for all reflections | 0.0485 |
Residual factor for significantly intense reflections | 0.0383 |
Weighted residual factors for significantly intense reflections | 0.1074 |
Weighted residual factors for all reflections included in the refinement | 0.1116 |
Goodness-of-fit parameter for all reflections included in the refinement | 1.036 |
Diffraction radiation wavelength | 0.71073 Å |
Diffraction radiation type | MoKα |