Information card for entry 7111340
Formula | C66 H48 Cd2 N16 O12 |
Calculated formula | C66 H48 Cd2 N16 O12 |
Title of publication | Assembly of large simple 1D and rare polycatenated 3D molecular ladders from T-shaped building blocks containing a new, long N,N?-bidentate ligand |
Authors of publication | Su, Cheng-Yong; Goforth, Andrea M.; Smith, Mark D.; zur Loye, Hans-Conrad |
Journal of publication | Chemical Communications |
Year of publication | 2004 |
Journal issue | 19 |
Pages of publication | 2158 - 2159 |
a | 15.6034 ± 0.0009 Å |
b | 13.5413 ± 0.0008 Å |
c | 15.8953 ± 0.001 Å |
α | 90° |
β | 116.069 ± 0.001° |
γ | 90° |
Cell volume | 3016.8 ± 0.3 Å3 |
Cell temperature | 150 ± 1 K |
Ambient diffraction temperature | 150 ± 1 K |
Number of distinct elements | 5 |
Space group number | 14 |
Hermann-Mauguin space group symbol | P 1 21/n 1 |
Hall space group symbol | -P 2yn |
Residual factor for all reflections | 0.0556 |
Residual factor for significantly intense reflections | 0.0496 |
Weighted residual factors for significantly intense reflections | 0.1113 |
Weighted residual factors for all reflections included in the refinement | 0.1148 |
Goodness-of-fit parameter for all reflections included in the refinement | 1.057 |
Diffraction radiation wavelength | 0.71073 Å |
Diffraction radiation type | MoKα |