Information card for entry 7112284
Formula | C27 H31 B F2 N2 O2 |
Calculated formula | C27 H31 B F2 N2 O2 |
Title of publication | Axially chiral BODIPYs. |
Authors of publication | Lerrick, Reinner I.; Winstanley, Thomas P. L.; Haggerty, Karen; Wills, Corinne; Clegg, William; Harrington, Ross W.; Bultinck, Patrick; Herrebout, Wouter; Benniston, Andrew C.; Hall, Michael J. |
Journal of publication | Chemical communications (Cambridge, England) |
Year of publication | 2014 |
Journal volume | 50 |
Journal issue | 36 |
Pages of publication | 4714 - 4716 |
a | 7.712 ± 0.005 Å |
b | 25.125 ± 0.015 Å |
c | 12.348 ± 0.007 Å |
α | 90° |
β | 92.318 ± 0.007° |
γ | 90° |
Cell volume | 2391 ± 3 Å3 |
Cell temperature | 150 K |
Ambient diffraction temperature | 150 K |
Number of distinct elements | 6 |
Space group number | 14 |
Hermann-Mauguin space group symbol | P 1 21/c 1 |
Hall space group symbol | -P 2ybc |
Residual factor for all reflections | 0.1055 |
Residual factor for significantly intense reflections | 0.0581 |
Weighted residual factors for significantly intense reflections | 0.1469 |
Weighted residual factors for all reflections included in the refinement | 0.1715 |
Goodness-of-fit parameter for all reflections included in the refinement | 1.028 |
Diffraction radiation probe | x-ray |
Diffraction radiation wavelength | 0.6889 Å |