Information card for entry 7112482
Formula | C21 H19 F6 Mn N3 O8 S2 |
Calculated formula | C21 H19 F6 Mn N3 O8 S2 |
Title of publication | Ligand tuning of single-site manganese-based catalytic antioxidants with dual superoxide dismutase and catalase activity |
Authors of publication | Grau, Michaela; Rigodanza, Francesco; White, Andrew J. P.; Sorarù, Antonio; Carraro, Mauro; Bonchio, Marcella; Britovsek, George J. P. |
Journal of publication | Chemical Communications (Cambridge, United Kingdom) |
Year of publication | 2014 |
Journal volume | 50 |
Journal issue | 35 |
Pages of publication | 4607 - 4609 |
a | 9.9713 ± 0.0003 Å |
b | 10.0552 ± 0.0004 Å |
c | 14.007 ± 0.0005 Å |
α | 95.426 ± 0.003° |
β | 99.237 ± 0.003° |
γ | 99.809 ± 0.003° |
Cell volume | 1355.14 ± 0.09 Å3 |
Cell temperature | 173 K |
Ambient diffraction temperature | 173 K |
Number of distinct elements | 7 |
Space group number | 2 |
Hermann-Mauguin space group symbol | P -1 |
Hall space group symbol | -P 1 |
Residual factor for all reflections | 0.0597 |
Residual factor for significantly intense reflections | 0.043 |
Weighted residual factors for significantly intense reflections | 0.1117 |
Weighted residual factors for all reflections included in the refinement | 0.12 |
Goodness-of-fit parameter for all reflections included in the refinement | 1.08 |
Diffraction radiation wavelength | 0.71073 Å |
Diffraction radiation type | MoKα |