Information card for entry 7116612
Formula | Cs2 H30.8 K10 Nb12 O65.4 Pt2 |
Calculated formula | Cs2 K10 Nb12 O65.4 Pt2 |
Title of publication | Platinum polyoxoniobates |
Authors of publication | Abramov, P. A.; Vicent, C.; Kompankov, N. B.; Gushchin, A. L.; Sokolov, M. N. |
Journal of publication | Chemical Communications (Cambridge, United Kingdom) |
Year of publication | 2015 |
Journal volume | 51 |
Journal issue | 19 |
Pages of publication | 4021 - 4023 |
a | 10.5213 ± 0.0016 Å |
b | 12.6202 ± 0.0019 Å |
c | 15.122 ± 0.002 Å |
α | 96.136 ± 0.004° |
β | 98.791 ± 0.004° |
γ | 96.912 ± 0.005° |
Cell volume | 1953.8 ± 0.5 Å3 |
Cell temperature | 150 ± 2 K |
Ambient diffraction temperature | 150 ± 2 K |
Number of distinct elements | 6 |
Space group number | 2 |
Hermann-Mauguin space group symbol | P -1 |
Hall space group symbol | -P 1 |
Residual factor for all reflections | 0.1015 |
Residual factor for significantly intense reflections | 0.082 |
Weighted residual factors for significantly intense reflections | 0.2189 |
Weighted residual factors for all reflections included in the refinement | 0.2301 |
Goodness-of-fit parameter for all reflections included in the refinement | 1.128 |
Diffraction radiation probe | x-ray |
Diffraction radiation wavelength | 0.71073 Å |
Diffraction radiation type | MoKα |